wiki:CannotCompiledPackages

Packages Cannot Be Compiled with LIND SDK

Remaining Problem:

configure: error: Either a previously installed pkg-config or "glib-2.0 >= 2.16" could not be found. Please set GLIB_CFLAGS and GLIB_LIBS to the correct values or pass --with-internal-glib to configure to use the bundled copy.

Remaining Problem:

make[3]: Entering directory `/home/larrycane/Code/LIND/LIND_BASE/shadow-4.1.5.1/man/da'
you need to run configure with --enable-man to generate man pages
make[3]: *** [man1/chfn.1] Error 1
make[3]: Leaving directory `/home/larrycane/Code/LIND/LIND_BASE/shadow-4.1.5.1/man/da'
make[2]: *** [all-recursive] Error 1
make[2]: Leaving directory `/home/larrycane/Code/LIND/LIND_BASE/shadow-4.1.5.1/man'
make[1]: *** [all-recursive] Error 1
make[1]: Leaving directory `/home/larrycane/Code/LIND/LIND_BASE/shadow-4.1.5.1'
make: *** [all] Error 2

Remaining Problem:

libblkid/src/topology/ioctl.c:33: error: 'BLKALIGNOFF' undeclared here (not in a function)
libblkid/src/topology/ioctl.c:34: error: 'BLKIOMIN' undeclared here (not in a function)
libblkid/src/topology/ioctl.c:35: error: 'BLKIOOPT' undeclared here (not in a function)
libblkid/src/topology/ioctl.c:36: error: 'BLKPBSZGET' undeclared here (not in a function)
make[2]: *** [libblkid/src/topology/libblkid_la-ioctl.lo] Error 1
make[2]: Leaving directory `/home/larrycane/Code/LIND/LIND_BASE/util-linux-2.23.2'
make[1]: *** [all-recursive] Error 1
make[1]: Leaving directory `/home/larrycane/Code/LIND/LIND_BASE/util-linux-2.23.2'
make: *** [all] Error 2

Remaining Problem:

configure: error: Cannot find tinfo, ncurses or termcap libraries

Remaining Problem:

display.o: In function `main':
display.c:(.text+0x63c): warning: warning: sigaction is not implemented and will always fail
display.o: In function `signal_handler':
display.c:(.text+0x178a): warning: warning: kill is not implemented and will always fail
stacktrace.o: In function `stack_trace':
stacktrace.c:(.text+0xbc): warning: warning: fork is not implemented and will always fail
display.o: In function `main':
display.c:(.text+0x85c): undefined reference to `rpl_malloc'
display.c:(.text+0x10bc): undefined reference to `rpl_malloc'
display.c:(.text+0x155c): undefined reference to `rpl_malloc'
parser.o: In function `parse_list':
parser.c:(.text+0x3bc): undefined reference to `rpl_malloc'
parser.c:(.text+0x3fc): undefined reference to `rpl_malloc'
parser.o:parser.c:(.text+0x1fbc): more undefined references to `rpl_malloc' follow
../proc/.libs/libprocps.a(alloc.o): In function `xrealloc':
alloc.c:(.text+0x27c): undefined reference to `rpl_realloc'
collect2: ld returned 1 exit status
make[2]: *** [pscommand.nexe] Error 1
make[2]: Leaving directory `/home/larrycane/Code/LIND/LIND_BASE/procps-ng-3.3.8/ps'
make[1]: *** [all-recursive] Error 1
make[1]: Leaving directory `/home/larrycane/Code/LIND/LIND_BASE/procps-ng-3.3.8'
make: *** [all] Error 2

Remaining Problem

chattr.c: In function ‘change_attributes’:
chattr.c:196: error: storage size of ‘st’ isn’t known
make[2]: *** [chattr.o] Error 1
make[2]: Leaving directory `/home/larrycane/Code/LIND/LIND_BASE/e2fsprogs-1.42.8/misc'
make[1]: *** [all-progs-recursive] Error 1
make[1]: Leaving directory `/home/larrycane/Code/LIND/LIND_BASE/e2fsprogs-1.42.8'
make: *** [all] Error 2

Remaining Problem:

lib/libcoreutils.a(chdir-long.o): In function `cdb_advance_fd':
chdir-long.c:(.text+0xbc): undefined reference to `openat64'
lib/libcoreutils.a(getcwd.o): In function `rpl_getcwd':
getcwd.c:(.text+0x1bc): undefined reference to `openat64'
collect2: ld returned 1 exit status
make[2]: *** [src/df.nexe] Error 1
make[2]: Leaving directory `/home/larrycane/Code/LIND/LIND_BASE/coreutils-8.21'
make[1]: *** [all-recursive] Error 1
make[1]: Leaving directory `/home/larrycane/Code/LIND/LIND_BASE/coreutils-8.21'
make: *** [all] Error 2

Remaining Problem:

test -z "lib/liby.a" || rm -f lib/liby.a
test ! -f ./tests/testsuite || ./tests/testsuite -C tests --clean
make[1]: *** [clean-local-tests] Error 77
make[1]: Leaving directory `/home/larrycane/Code/LIND/LIND_BASE/bison-3.0'
make: *** [clean-recursive] Error 1

Remaining Problem:

execute_cmd.c: In function ‘execute_pipeline’:
execute_cmd.c:2205: error: ‘job_control’ undeclared (first use in this function)
execute_cmd.c:2205: error: (Each undeclared identifier is reported only once
execute_cmd.c:2205: error: for each function it appears in.)
execute_cmd.c: In function ‘execute_function’:
execute_cmd.c:4243: warning: passing argument 1 of ‘array_rshift’ discards qualifiers from pointer target type
array.h:56: note: expected ‘struct ARRAY *’ but argument is of type ‘volatile struct ARRAY *’
execute_cmd.c:4245: warning: passing argument 1 of ‘array_rshift’ discards qualifiers from pointer target type
array.h:56: note: expected ‘struct ARRAY *’ but argument is of type ‘volatile struct ARRAY *’
execute_cmd.c:4320: warning: passing argument 1 of ‘array_shift’ discards qualifiers from pointer target type
array.h:55: note: expected ‘struct ARRAY *’ but argument is of type ‘volatile struct ARRAY *’
execute_cmd.c:4321: warning: passing argument 1 of ‘array_shift’ discards qualifiers from pointer target type
array.h:55: note: expected ‘struct ARRAY *’ but argument is of type ‘volatile struct ARRAY *’
make: *** [execute_cmd.o] Error 1

Remaining Problem:

hostname.c:20:20: error: config.h: No such file or directory
hostname.c:32:22: error: progname.h: No such file or directory
hostname.c:33:26: error: libinetutils.h: No such file or directory
hostname.c:34:20: error: xalloc.h: No such file or directory
hostname.c:35:26: error: xgethostname.h: No such file or directory
hostname.c:36:28: error: xgetdomainname.h: No such file or directory
hostname.c: In function 'parse_opt':
hostname.c:83: error: 'xgethostname' undeclared (first use in this function)
hostname.c:83: error: (Each undeclared identifier is reported only once
hostname.c:83: error: for each function it appears in.)
hostname.c:115: error: 'xgetdomainname' undeclared (first use in this function)
hostname.c: In function 'main':
hostname.c:148: warning: implicit declaration of function 'set_program_name'
hostname.c:153: warning: implicit declaration of function 'iu_argp_init'
hostname.c:158: error: 'xgethostname' undeclared (first use in this function)
hostname.c:160: error: 'xgetdomainname' undeclared (first use in this function)
hostname.c: In function 'get_aliases':
hostname.c:241: warning: implicit declaration of function 'xmalloc'
hostname.c:241: warning: assignment makes pointer from integer without a cast
hostname.c:258: warning: implicit declaration of function 'xrealloc'
hostname.c:258: warning: assignment makes pointer from integer without a cast
hostname.c: In function 'get_ip_addresses':
hostname.c:297: warning: assignment makes pointer from integer without a cast
hostname.c:317: warning: assignment makes pointer from integer without a cast
hostname.c: In function 'get_short_hostname':
hostname.c:359: warning: implicit declaration of function 'strndup'
hostname.c:359: warning: incompatible implicit declaration of built-in function 'strndup'
hostname.c: In function 'parse_file':
hostname.c:383: warning: implicit declaration of function 'getline'
hostname.c:389: warning: assignment makes pointer from integer without a cast
make[2]: *** [hostname] Error 1
make[2]: Leaving directory `/home/larrycane/Code/LIND/LIND_BASE/inetutils-1.9.1/src'
make[1]: *** [all-recursive] Error 1
make[1]: Leaving directory `/home/larrycane/Code/LIND/LIND_BASE/inetutils-1.9.1'
make: *** [all] Error 2

Remaining Problem:

/bin/bash: ../gawk.nexe: No such file or directory
Building the extensions is not supported on this platform
make[3]: *** [check-for-shared-lib-support] Error 1
make[3]: Leaving directory `/home/larrycane/Code/LIND/LIND_BASE/gawk-4.1.0/extension'
make[2]: *** [all] Error 2
make[2]: Leaving directory `/home/larrycane/Code/LIND/LIND_BASE/gawk-4.1.0/extension'
Making all in test
make[2]: Entering directory `/home/larrycane/Code/LIND/LIND_BASE/gawk-4.1.0/test'
make[2]: Nothing to be done for `all'.
make[2]: Leaving directory `/home/larrycane/Code/LIND/LIND_BASE/gawk-4.1.0/test'
make[1]: *** [all-recursive] Error 1
make[1]: Leaving directory `/home/larrycane/Code/LIND/LIND_BASE/gawk-4.1.0'
make: *** [all] Error 2

Remaining Problem:

In file included from ./stdio.h:31,
                 from areadlink-with-size.c:25:
/home/larrycane/Code/LIND/REPY_PATH/sdk/toolchain/linux_x86_glibc/bin/../lib/gcc/x86_64-nacl/4.4.3/../../../../x86_64-nacl/include/stdio.h:720: error: expected declaration specifiers or ‘...’ before ‘(’ token
/home/larrycane/Code/LIND/REPY_PATH/sdk/toolchain/linux_x86_glibc/bin/../lib/gcc/x86_64-nacl/4.4.3/../../../../x86_64-nacl/include/stdio.h:720: error: conflicting types for ‘rpl_fseeko’
./stdio.h:275: note: previous declaration of ‘rpl_fseeko’ was here
make[4]: *** [areadlink-with-size.o] Error 1
make[4]: Leaving directory `/home/larrycane/Code/LIND/LIND_BASE/findutils-4.4.2/gnulib/lib'
make[3]: *** [all] Error 2
make[3]: Leaving directory `/home/larrycane/Code/LIND/LIND_BASE/findutils-4.4.2/gnulib/lib'
make[2]: *** [all-recursive] Error 1
make[2]: Leaving directory `/home/larrycane/Code/LIND/LIND_BASE/findutils-4.4.2/gnulib'
make[1]: *** [all-recursive] Error 1
make[1]: Leaving directory `/home/larrycane/Code/LIND/LIND_BASE/findutils-4.4.2'
make: *** [all] Error 2

Remaining Problem:

/bin/bash: /home/larrycane/Code/LIND/LIND_BASE/groff-1.22.2/src/roff/groff/groff: No such file or directory
make[2]: *** [meref.ps] Error 127
make[2]: Leaving directory `/home/larrycane/Code/LIND/LIND_BASE/groff-1.22.2/doc'
make[1]: *** [doc] Error 2
make[1]: Leaving directory `/home/larrycane/Code/LIND/LIND_BASE/groff-1.22.2'
make: *** [all] Error 2

Remaining Problem:

checking whether `/home/larrycane/Code/LIND/REPY_PATH/sdk/toolchain/linux_x86_glibc/bin/x86_64-nacl-gcc' generates calls to `__enable_execute_stack()'... configure: error: /home/larrycane/Code/LIND/REPY_PATH/sdk/toolchain/linux_x86_glibc/bin/x86_64-nacl-gcc failed to produce assembly code

Remaining Problem:

In file included from ll_types.c:24:
../include/linux/netdevice.h:30:29: error: linux/if_packet.h: No such file or directory
make[1]: *** [ll_types.o] Error 1
make[1]: Leaving directory `/home/larrycane/Code/LIND/LIND_BASE/iproute2-3.10.0/lib'
make: *** [all] Error 2

Remaining Problem:

configure: error: libpam-devel required.

Remaining Problem:

configure: error: --enable-static is not supported by kmod

Remaining Problem:

configure: error: in `/home/larrycane/Code/LIND/LIND_BASE/libpipeline-1.2.4':
configure: error: cannot use libpipeline on systems without fork

Remaining Problem:

configure: error: Package requirements (libpipeline >= 1.1.0) were not met:

No package 'libpipeline' found

Remaining Problem:

no terminal library found
checking for tgetent()... configure: error: NOT FOUND!
      You need to install a terminal library; for example ncurses.
      Or specify the name of the library with --with-tlib.

Have Not Been Tried

Last modified 4 years ago Last modified on Oct 29, 2013 11:23:19 AM